{"text_format":"1","workbook":"xlsx","n_sheets":3,"sheets":["Results13of18","Sheet1","SortBest"],"not_rendered":{"charts":0,"images":0,"macros":1,"external_links":0,"defined_names":2,"comments":0,"pivot_tables":0},"unopened":[],"bounds":{"document_bytes":16777216,"sheet_cells":100000,"rows_first":2000,"rows_last":500,"rows_between":2000,"halvings":0,"cell_chars":16384,"cell_head_chars":4096},"cells_cut":0,"cells_raw":0,"read":"whole","date_system":"1900"}

{"sheet":"Results13of18","index":0,"n_rows":109,"n_cols":21,"rows_kept":109,"cut":false,"hidden":false,"merged":[[0,1,0,3],[66,1,66,3]]}
[null,"WALLASEY ATHLETIC CLUB GRAND PRIX 2022-2023",null,null,"MT Royden Park 06/09/22","MT Wallasey  13/09/22","MT WCP 20/09/22","MT Arrowe Park 27/09/22","BL 1 New Brighton 16/10/22","BL 2 Tattenhall 13/11/22","L&D Champs Sefton Park 26/11/2022","BL 3 Trac Mon 18/12/22","Merseyside CC Arrowe Park 07/01/23","Northern CC Blackburn 28/01/23","L&D Champs Clarke's Garden 19/02/23","National CC Tattenhall 26/02/23","BL 5 cancelled 19/03/23","BL 6 Mold 16/04/23","BL 4 Delamere 23/04/23","BL 7 Prestatyn 17/05/23","Total"]
["MEN","Division 1",1,"PEARSE, Rob",30,29,29,29,28,27,29,29,29,29,29,30,0,0,29,0,{"$f":"VLOOKUP(D2,SortBest!A:T,20,FALSE)","v":321}]
[null,null,2,"BARBAT, Tony",26,28,27,27,25,24,25,25,26,27,0,0,0,28,27,26,{"$f":"VLOOKUP(D3,SortBest!A:T,20,FALSE)","v":292}]
[null,null,3,"NORTON, Steve",25,27,26,26,23,20,0,24,0,0,27,0,0,26,25,24,{"$f":"VLOOKUP(D4,SortBest!A:T,20,FALSE)","v":273}]
[null,null,4,"CHADWICK, Oliver",0,30,30,30,29,28,30,30,30,0,0,0,0,29,0,0,{"$f":"VLOOKUP(D5,SortBest!A:T,20,FALSE)","v":266}]
[null,null,5,"MCALISTER, Dave",0,26,23,25,22,19,22,23,24,0,0,26,0,25,24,23,{"$f":"VLOOKUP(D6,SortBest!A:T,20,FALSE)","v":263}]
[null,null,6,"CUTHBERT, Phil",27,0,28,28,0,0,24,0,0,28,0,28,0,0,0,25,{"$f":"VLOOKUP(D7,SortBest!A:T,20,FALSE)","v":188}]
[null,null,7,"JONES, Christopher",0,0,0,0,27,26,0,28,0,30,0,0,0,0,28,29,{"$f":"VLOOKUP(D8,SortBest!A:T,20,FALSE)","v":168}]
[null,null,8,"HARLEY-GRIFFITHS, Mike",0,24,24,23,20,18,21,0,0,26,0,0,0,0,0,0,{"$f":"VLOOKUP(D9,SortBest!A:T,20,FALSE)","v":156}]
[null,null,9,"BODEN, Joe",0,0,0,0,30,30,0,0,0,0,0,0,0,30,30,30,{"$f":"VLOOKUP(D10,SortBest!A:T,20,FALSE)","v":150}]
[null,null,10,"BASSETT, John",0,0,0,0,0,21,23,0,25,0,28,27,0,0,26,0,{"$f":"VLOOKUP(D11,SortBest!A:T,20,FALSE)","v":150}]
[null,null,11,"GILLBANKS, Matt",0,0,0,0,26,25,0,26,27,0,0,0,0,0,0,27,{"$f":"VLOOKUP(D12,SortBest!A:T,20,FALSE)","v":131}]
[null,null,12,"BIRD, Phil",24,25,25,24,21,0,0,0,0,0,0,0,0,0,0,0,{"$f":"VLOOKUP(D13,SortBest!A:T,20,FALSE)","v":119}]
[null,null,13,"BREALEY, Steve",0,0,0,0,0,0,28,27,28,0,0,0,0,0,0,28,{"$f":"VLOOKUP(D14,SortBest!A:T,20,FALSE)","v":111}]
[null,null,14,"HALL, Kevin",0,0,0,0,24,23,0,0,0,0,0,0,0,27,0,0,{"$f":"VLOOKUP(D15,SortBest!A:T,20,FALSE)","v":74}]
[null,null,15,"POLAND, Jack",0,0,0,0,0,29,0,0,0,0,30,0,0,0,0,0,{"$f":"VLOOKUP(D16,SortBest!A:T,20,FALSE)","v":59}]
[null,null,16,"MCARDLE, Connor",0,0,0,0,0,0,27,0,0,0,0,29,0,0,0,0,{"$f":"VLOOKUP(D17,SortBest!A:T,20,FALSE)","v":56}]
[null,null,17,"WALKER, Jay",29,0,0,0,0,22,0,0,0,0,0,0,0,0,0,0,{"$f":"VLOOKUP(D18,SortBest!A:T,20,FALSE)","v":51}]
[null,null,18,"DABNER, Phil",28,0,0,0,0,0,0,0,0,0,0,0,0,0,0,0,{"$f":"VLOOKUP(D19,SortBest!A:T,20,FALSE)","v":28}]
[null,null,19,"GREEN, Mike",0,0,0,0,0,0,26,0,0,0,0,0,0,0,0,0,{"$f":"VLOOKUP(D20,SortBest!A:T,20,FALSE)","v":26}]
[null,"Division 2",1,"COSGROVE, Steve",23,26,28,29,27,25,0,27,29,30,30,30,0,28,28,28,{"$f":"VLOOKUP(D21,SortBest!A:T,20,FALSE)","v":314}]
[null,null,2,"BARHAM, Pete",17,17,19,19,17,16,0,24,26,29,27,0,0,0,26,25,{"$f":"VLOOKUP(D22,SortBest!A:T,20,FALSE)","v":246}]
[null,null,3,"WHITWORTH, Rab",20,20,23,23,21,18,0,25,27,0,0,0,0,0,27,26,{"$f":"VLOOKUP(D23,SortBest!A:T,20,FALSE)","v":230}]
[null,null,4,"ROBSON, Michael",28,29,29,0,28,26,0,28,0,0,0,0,0,0,29,30,{"$f":"VLOOKUP(D24,SortBest!A:T,20,FALSE)","v":227}]
[null,null,5,"DYSON, Mike",21,25,27,28,25,21,0,0,0,0,29,0,0,0,0,0,{"$f":"VLOOKUP(D25,SortBest!A:T,20,FALSE)","v":176}]
[null,null,6,"SEAL, Brian",16,22,22,22,22,19,0,22,0,0,28,0,0,0,0,0,{"$f":"VLOOKUP(D26,SortBest!A:T,20,FALSE)","v":173}]
[null,null,7,"FAYLE, Joseph",27,28,0,25,23,24,0,0,0,0,0,0,0,27,0,0,{"$f":"VLOOKUP(D27,SortBest!A:T,20,FALSE)","v":154}]
[null,null,8,"BROMLEY, Andrew",0,0,0,0,30,30,0,30,0,0,0,0,0,30,30,0,{"$f":"VLOOKUP(D28,SortBest!A:T,20,FALSE)","v":150}]
[null,null,9,"FOSTER, Stewart",10,8,14,14,9,0,0,0,25,0,0,0,0,25,23,20,{"$f":"VLOOKUP(D29,SortBest!A:T,20,FALSE)","v":148}]
[null,null,10,"JOHNSTONE, Paul",24,23,25,24,0,22,0,0,0,0,0,0,0,0,0,0,{"$f":"VLOOKUP(D30,SortBest!A:T,20,FALSE)","v":118}]
[null,null,11,"HOLMES, Tony",11,12,13,13,8,12,0,21,0,0,0,0,0,0,0,21,{"$f":"VLOOKUP(D31,SortBest!A:T,20,FALSE)","v":111}]
[null,null,12,"HAMPSHIRE, William",26,27,26,27,0,0,0,0,0,0,0,0,0,0,0,0,{"$f":"VLOOKUP(D32,SortBest!A:T,20,FALSE)","v":106}]
[null,null,13,"POUSTIE, Mark",0,0,0,0,24,23,30,0,28,0,0,0,0,0,0,0,{"$f":"VLOOKUP(D33,SortBest!A:T,20,FALSE)","v":105}]
[null,null,14,"GOUGH, Dermot",25,24,24,26,0,0,0,0,0,0,0,0,0,0,0,0,{"$f":"VLOOKUP(D34,SortBest!A:T,20,FALSE)","v":99}]
[null,null,15,"WARREN, Dominic",18,18,18,20,19,0,0,0,0,0,0,0,0,0,0,0,{"$f":"VLOOKUP(D35,SortBest!A:T,20,FALSE)","v":93}]
[null,null,16,"MCARDLE, Derek",0,7,0,0,14,17,29,23,0,0,0,0,0,0,0,0,{"$f":"VLOOKUP(D36,SortBest!A:T,20,FALSE)","v":90}]
[null,null,17,"HAMPSHIRE, Luke",29,30,0,30,0,0,0,0,0,0,0,0,0,0,0,0,{"$f":"VLOOKUP(D37,SortBest!A:T,20,FALSE)","v":89}]
[null,null,18,"SUMMERFIELD, Leon",15,15,16,0,15,0,0,0,0,0,26,0,0,0,0,0,{"$f":"VLOOKUP(D38,SortBest!A:T,20,FALSE)","v":87}]
[null,null,19,"CLARK, Ray",0,0,0,0,29,29,0,0,0,0,0,0,0,29,0,0,{"$f":"VLOOKUP(D39,SortBest!A:T,20,FALSE)","v":87}]
[null,null,20,"GORMAN, Louis",0,0,0,0,0,27,0,29,30,0,0,0,0,0,0,0,{"$f":"VLOOKUP(D40,SortBest!A:T,20,FALSE)","v":86}]
[null,null,21,"ROUGHLEY, Andrew",22,21,21,21,0,0,0,0,0,0,0,0,0,0,0,0,{"$f":"VLOOKUP(D41,SortBest!A:T,20,FALSE)","v":85}]
[null,null,22,"COLE, Steve",0,0,12,17,12,15,0,0,0,0,0,0,0,0,25,0,{"$f":"VLOOKUP(D42,SortBest!A:T,20,FALSE)","v":81}]
[null,null,23,"GIBBONS, Neil",13,11,0,16,10,14,0,0,0,0,0,0,0,0,0,0,{"$f":"VLOOKUP(D43,SortBest!A:T,20,FALSE)","v":64}]
[null,null,24,"SHARP, Ben",0,0,0,0,20,20,0,0,0,0,0,0,0,0,0,23,{"$f":"VLOOKUP(D44,SortBest!A:T,20,FALSE)","v":63}]
[null,null,25,"GREENWOOD, Ryan",30,0,30,0,0,0,0,0,0,0,0,0,0,0,0,0,{"$f":"VLOOKUP(D45,SortBest!A:T,20,FALSE)","v":60}]
[null,null,26,"WADE, David",19,16,20,0,0,0,0,0,0,0,0,0,0,0,0,0,{"$f":"VLOOKUP(D46,SortBest!A:T,20,FALSE)","v":55}]
[null,null,27,"YEM, Alex",0,0,0,0,26,0,0,26,0,0,0,0,0,0,0,0,{"$f":"VLOOKUP(D47,SortBest!A:T,20,FALSE)","v":52}]
[null,null,28,"GOODENOUGH, Mike",12,10,15,15,0,0,0,0,0,0,0,0,0,0,0,0,{"$f":"VLOOKUP(D48,SortBest!A:T,20,FALSE)","v":52}]
[null,null,29,"SALES, Sean",0,0,0,0,0,0,0,0,0,0,0,0,0,0,24,22,{"$f":"VLOOKUP(D49,SortBest!A:T,20,FALSE)","v":46}]
[null,null,30,"YANG, Jack",0,0,0,0,18,0,0,0,0,0,0,0,0,0,0,27,{"$f":"VLOOKUP(D50,SortBest!A:T,20,FALSE)","v":45}]
[null,null,31,"PLESTED, Tim",0,13,17,0,11,0,0,0,0,0,0,0,0,0,0,0,{"$f":"VLOOKUP(D51,SortBest!A:T,20,FALSE)","v":41}]
[null,null,32,"ALI, Abir",0,0,0,0,0,11,0,0,0,0,0,0,0,0,0,19,{"$f":"VLOOKUP(D52,SortBest!A:T,20,FALSE)","v":30}]
[null,null,33,"WATSON, Luke",0,0,0,0,0,0,0,0,0,0,0,0,0,0,0,29,{"$f":"VLOOKUP(D53,SortBest!A:T,20,FALSE)","v":29}]
[null,null,34,"JONES, Mike T",0,0,0,0,0,28,0,0,0,0,0,0,0,0,0,0,{"$f":"VLOOKUP(D54,SortBest!A:T,20,FALSE)","v":28}]
[null,null,35,"CONNELL, Martin",14,14,0,0,0,0,0,0,0,0,0,0,0,0,0,0,{"$f":"VLOOKUP(D55,SortBest!A:T,20,FALSE)","v":28}]
[null,null,36,"RAE, Nick",9,6,0,12,0,0,0,0,0,0,0,0,0,0,0,0,{"$f":"VLOOKUP(D56,SortBest!A:T,20,FALSE)","v":27}]
[null,null,37,"MITCHELL, Rob",0,0,0,0,0,0,0,0,0,0,0,0,0,26,0,0,{"$f":"VLOOKUP(D57,SortBest!A:T,20,FALSE)","v":26}]
[null,null,38,"STOCKER, Ken",8,0,0,0,6,10,0,0,0,0,0,0,0,0,0,0,{"$f":"VLOOKUP(D58,SortBest!A:T,20,FALSE)","v":24}]
[null,null,39,"BACKINSELL, Jim",0,0,0,0,0,0,0,0,0,0,0,0,0,0,0,24,{"$f":"VLOOKUP(D59,SortBest!A:T,20,FALSE)","v":24}]
[null,null,40,"CLARKE, Steve",0,19,0,0,0,0,0,0,0,0,0,0,0,0,0,0,{"$f":"VLOOKUP(D60,SortBest!A:T,20,FALSE)","v":19}]
[null,null,41,"HOGG, John",0,0,0,18,0,0,0,0,0,0,0,0,0,0,0,0,{"$f":"VLOOKUP(D61,SortBest!A:T,20,FALSE)","v":18}]
[null,null,42,"WILD, Joshua",0,0,0,0,16,0,0,0,0,0,0,0,0,0,0,0,{"$f":"VLOOKUP(D62,SortBest!A:T,20,FALSE)","v":16}]
[null,null,43,"HAMPSON, Aiden",0,0,0,0,13,0,0,0,0,0,0,0,0,0,0,0,{"$f":"VLOOKUP(D63,SortBest!A:T,20,FALSE)","v":13}]
[null,null,44,"PERRY, Robert",0,0,0,0,0,13,0,0,0,0,0,0,0,0,0,0,{"$f":"VLOOKUP(D64,SortBest!A:T,20,FALSE)","v":13}]
[null,null,45,"NOBLE, Kenneth",0,9,0,0,0,0,0,0,0,0,0,0,0,0,0,0,{"$f":"VLOOKUP(D65,SortBest!A:T,20,FALSE)","v":9}]
[null,null,46,"THOMAS, Dave",0,0,0,0,7,0,0,0,0,0,0,0,0,0,0,0,{"$f":"VLOOKUP(D66,SortBest!A:T,20,FALSE)","v":7}]
[null,{"$f":"B1","v":"WALLASEY ATHLETIC CLUB GRAND PRIX 2022-2023"},null,null,"MT Royden Park 06/09/22","MT Wallasey  13/09/22","MT WCP 20/09/22","MT Arrowe Park 27/09/22","BL 1 New Brighton 16/10/22","BL 2 Tattenhall 13/11/22","L&D Champs Sefton Park 26/11/2022","BL 3 Trac Mon 18/12/22","Merseyside CC Arrowe Park 07/01/23","Northern CC Blackburn 28/01/23","L&D Champs Clarke's Garden 19/02/23","National CC Tattenhall 26/02/23","BL 5 cancelled 19/03/23","BL 6 Mold 16/04/23","BL 4 Delamere 23/04/23","BL 7 Prestatyn 17/05/23","Total"]
["WOMEN",null,1,"BLACKLOCK, Becky",30,30,30,30,30,30,30,30,30,0,30,0,0,30,30,30,{"$f":"VLOOKUP(D68,SortBest!A:T,20,FALSE)","v":330}]
[null,null,2,"MCARD, Jan",27,29,29,28,29,29,0,28,27,29,0,29,0,0,28,29,{"$f":"VLOOKUP(D69,SortBest!A:T,20,FALSE)","v":314}]
[null,null,3,"ALTY, Michelle",0,0,0,0,27,26,27,27,26,30,27,30,0,29,29,28,{"$f":"VLOOKUP(D70,SortBest!A:T,20,FALSE)","v":306}]
[null,null,4,"REYNOLDS, Sue",28,26,27,0,28,27,0,26,28,28,25,27,0,26,26,0,{"$f":"VLOOKUP(D71,SortBest!A:T,20,FALSE)","v":297}]
[null,null,5,"STANSFIELD, Helen-Anne",25,0,25,26,25,25,28,25,24,0,0,0,0,24,0,26,{"$f":"VLOOKUP(D72,SortBest!A:T,20,FALSE)","v":253}]
[null,null,6,"GREENWOOD, Kirsty",23,21,23,23,18,0,24,0,20,25,21,24,0,0,22,24,{"$f":"VLOOKUP(D73,SortBest!A:T,20,FALSE)","v":250}]
[null,null,7,"COWDRAY, Kat",0,0,0,0,26,0,26,0,22,26,24,26,0,27,25,27,{"$f":"VLOOKUP(D74,SortBest!A:T,20,FALSE)","v":229}]
[null,null,8,"REES, Mary",21,0,24,21,21,23,0,0,19,24,0,23,0,19,18,15,{"$f":"VLOOKUP(D75,SortBest!A:T,20,FALSE)","v":228}]
[null,null,9,"LAMONT, Sharon",18,17,21,17,0,19,21,21,16,22,17,21,0,18,16,17,{"$f":"VLOOKUP(D76,SortBest!A:T,20,FALSE)","v":212}]
[null,null,10,"HUNTER, Maria",22,22,0,22,22,0,0,22,0,0,18,25,0,22,21,0,{"$f":"VLOOKUP(D77,SortBest!A:T,20,FALSE)","v":196}]
[null,null,11,"KENNY, Anna",0,0,0,0,0,0,0,24,25,27,26,28,0,28,27,0,{"$f":"VLOOKUP(D78,SortBest!A:T,20,FALSE)","v":185}]
[null,null,12,"ANDREWS, Katherine",10,9,12,0,20,13,20,0,0,23,12,19,0,23,11,21,{"$f":"VLOOKUP(D79,SortBest!A:T,20,FALSE)","v":184}]
[null,null,13,"CUCKSEY, Lesley-Anne",0,16,18,0,0,20,0,20,17,21,19,22,0,17,0,13,{"$f":"VLOOKUP(D80,SortBest!A:T,20,FALSE)","v":183}]
{"$rows_left_out":30}
{"sheet":"Sheet1","index":1,"n_rows":107,"n_cols":21,"rows_kept":107,"cut":false,"hidden":false,"merged":[]}
["AgeCat","RunnerGPDivision","Name","Race1Score","Race2Score","Race3Score","Race4Score","Race5Score","Race6Score","Race7Score","Race8Score","Race9Score","Race10Score","Race11Score","Race12Score","Race13Score","Race14Score","Race15Score","Race16Score","Race17Score","Race18Score"]
[1,1,"BODEN, Joe",0,0,0,0,30,30,0,0,0,0,0,0,0,30,30,30,0,0]
[1,1,"JONES, Christopher",0,0,0,0,27,26,0,28,0,30,0,0,0,0,28,29,0,0]
[1,1,"CHADWICK, Oliver",0,30,30,30,29,28,30,30,30,0,0,0,0,29,0,0,0,0]
[1,1,"NORTON, Steve",25,27,26,26,23,20,0,24,0,0,27,0,0,26,25,24,0,0]
[1,1,"WALKER, Jay",29,0,0,0,0,22,0,0,0,0,0,0,0,0,0,0,0,0]
[1,1,"POLAND, Jack",0,0,0,0,0,29,0,0,0,0,30,0,0,0,0,0,0,0]
[1,1,"PEARSE, Rob",30,29,29,29,28,27,29,29,29,29,29,30,0,0,29,0,0,0]
[1,1,"GILLBANKS, Matt",0,0,0,0,26,25,0,26,27,0,0,0,0,0,0,27,0,0]
[1,1,"DABNER, Phil",28,0,0,0,0,0,0,0,0,0,0,0,0,0,0,0,0,0]
[1,1,"BASSETT, John",0,0,0,0,0,21,23,0,25,0,28,27,0,0,26,0,0,0]
[1,1,"GREEN, Mike",0,0,0,0,0,0,26,0,0,0,0,0,0,0,0,0,0,0]
[1,1,"HARLEY-GRIFFITHS, Mike",0,24,24,23,20,18,21,0,0,26,0,0,0,0,0,0,0,0]
[1,1,"BREALEY, Steve",0,0,0,0,0,0,28,27,28,0,0,0,0,0,0,28,0,0]
[1,1,"MCALISTER, Dave",0,26,23,25,22,19,22,23,24,0,0,26,0,25,24,23,0,0]
[1,1,"CUTHBERT, Phil",27,0,28,28,0,0,24,0,0,28,0,28,0,0,0,25,0,0]
[1,1,"MCARDLE, Connor",0,0,0,0,0,0,27,0,0,0,0,29,0,0,0,0,0,0]
[1,1,"BARBAT, Tony",26,28,27,27,25,24,25,25,26,27,0,0,0,28,27,26,0,0]
[1,1,"BIRD, Phil",24,25,25,24,21,0,0,0,0,0,0,0,0,0,0,0,0,0]
[1,1,"HALL, Kevin",0,0,0,0,24,23,0,0,0,0,0,0,0,27,0,0,0,0]
[1,0,"HAMPSHIRE, William",26,27,26,27,0,0,0,0,0,0,0,0,0,0,0,0,0,0]
[1,0,"PLESTED, Tim",0,13,17,0,11,0,0,0,0,0,0,0,0,0,0,0,0,0]
[1,0,"SHARP, Ben",0,0,0,0,20,20,0,0,0,0,0,0,0,0,0,23,0,0]
[1,0,"HAMPSON, Aiden",0,0,0,0,13,0,0,0,0,0,0,0,0,0,0,0,0,0]
[1,0,"STOCKER, Ken",8,0,0,0,6,10,0,0,0,0,0,0,0,0,0,0,0,0]
[1,0,"JONES, Mike T",0,0,0,0,0,28,0,0,0,0,0,0,0,0,0,0,0,0]
[1,0,"SEAL, Brian",16,22,22,22,22,19,0,22,0,0,28,0,0,0,0,0,0,0]
[1,0,"POUSTIE, Mark",0,0,0,0,24,23,30,0,28,0,0,0,0,0,0,0,0,0]
[1,0,"DYSON, Mike",21,25,27,28,25,21,0,0,0,0,29,0,0,0,0,0,0,0]
[1,0,"GREENWOOD, Ryan",30,0,30,0,0,0,0,0,0,0,0,0,0,0,0,0,0,0]
[1,0,"WATSON, Luke",0,0,0,0,0,0,0,0,0,0,0,0,0,0,0,29,0,0]
[1,0,"ROUGHLEY, Andrew",22,21,21,21,0,0,0,0,0,0,0,0,0,0,0,0,0,0]
[1,0,"SUMMERFIELD, Leon",15,15,16,0,15,0,0,0,0,0,26,0,0,0,0,0,0,0]
[1,0,"MITCHELL, Rob",0,0,0,0,0,0,0,0,0,0,0,0,0,26,0,0,0,0]
[1,0,"JOHNSTONE, Paul",24,23,25,24,0,22,0,0,0,0,0,0,0,0,0,0,0,0]
[1,0,"HAMPSHIRE, Luke",29,30,0,30,0,0,0,0,0,0,0,0,0,0,0,0,0,0]
[1,0,"MCARDLE, Derek",0,7,0,0,14,17,29,23,0,0,0,0,0,0,0,0,0,0]
[1,0,"THOMAS, Dave",0,0,0,0,7,0,0,0,0,0,0,0,0,0,0,0,0,0]
[1,0,"ROBSON, Michael",28,29,29,0,28,26,0,28,0,0,0,0,0,0,29,30,0,0]
[1,0,"CONNELL, Martin",14,14,0,0,0,0,0,0,0,0,0,0,0,0,0,0,0,0]
[1,0,"CLARK, Ray",0,0,0,0,29,29,0,0,0,0,0,0,0,29,0,0,0,0]
[1,0,"COLE, Steve",0,0,12,17,12,15,0,0,0,0,0,0,0,0,25,0,0,0]
[1,0,"BARHAM, Pete",17,17,19,19,17,16,0,24,26,29,27,0,0,0,26,25,0,0]
[1,0,"YEM, Alex",0,0,0,0,26,0,0,26,0,0,0,0,0,0,0,0,0,0]
[1,0,"HOGG, John",0,0,0,18,0,0,0,0,0,0,0,0,0,0,0,0,0,0]
[1,0,"SALES, Sean",0,0,0,0,0,0,0,0,0,0,0,0,0,0,24,22,0,0]
[1,0,"YANG, Jack",0,0,0,0,18,0,0,0,0,0,0,0,0,0,0,27,0,0]
[1,0,"COSGROVE, Steve",23,26,28,29,27,25,0,27,29,30,30,30,0,28,28,28,0,0]
[1,0,"WILD, Joshua",0,0,0,0,16,0,0,0,0,0,0,0,0,0,0,0,0,0]
[1,0,"FOSTER, Stewart",10,8,14,14,9,0,0,0,25,0,0,0,0,25,23,20,0,0]
[1,0,"GIBBONS, Neil",13,11,0,16,10,14,0,0,0,0,0,0,0,0,0,0,0,0]
[1,0,"GOUGH, Dermot",25,24,24,26,0,0,0,0,0,0,0,0,0,0,0,0,0,0]
[1,0,"NOBLE, Kenneth",0,9,0,0,0,0,0,0,0,0,0,0,0,0,0,0,0,0]
[1,0,"CLARKE, Steve",0,19,0,0,0,0,0,0,0,0,0,0,0,0,0,0,0,0]
[1,0,"BACKINSELL, Jim",0,0,0,0,0,0,0,0,0,0,0,0,0,0,0,24,0,0]
[1,0,"ALI, Abir",0,0,0,0,0,11,0,0,0,0,0,0,0,0,0,19,0,0]
[1,0,"GOODENOUGH, Mike",12,10,15,15,0,0,0,0,0,0,0,0,0,0,0,0,0,0]
[1,0,"PERRY, Robert",0,0,0,0,0,13,0,0,0,0,0,0,0,0,0,0,0,0]
[1,0,"WADE, David",19,16,20,0,0,0,0,0,0,0,0,0,0,0,0,0,0,0]
[1,0,"FAYLE, Joseph",27,28,0,25,23,24,0,0,0,0,0,0,0,27,0,0,0,0]
[1,0,"RAE, Nick",9,6,0,12,0,0,0,0,0,0,0,0,0,0,0,0,0,0]
[1,0,"GORMAN, Louis",0,0,0,0,0,27,0,29,30,0,0,0,0,0,0,0,0,0]
[1,0,"BROMLEY, Andrew",0,0,0,0,30,30,0,30,0,0,0,0,0,30,30,0,0,0]
[1,0,"WARREN, Dominic",18,18,18,20,19,0,0,0,0,0,0,0,0,0,0,0,0,0]
[1,0,"WHITWORTH, Rab",20,20,23,23,21,18,0,25,27,0,0,0,0,0,27,26,0,0]
[1,0,"HOLMES, Tony",11,12,13,13,8,12,0,21,0,0,0,0,0,0,0,21,0,0]
[2,0,"GREENWOOD, Kirsty",23,21,23,23,18,0,24,0,20,25,21,24,0,0,22,24,0,0]
[2,0,"POLAND, Louise",0,0,19,19,0,0,0,0,0,0,0,0,0,0,0,0,0,0]
[2,0,"CUTHBERT, Isabella",26,27,26,27,0,24,0,0,0,0,0,0,0,0,0,23,0,0]
[2,0,"RYAN, Jenny",0,0,0,0,0,0,0,0,0,0,23,0,0,25,24,22,0,0]
[2,0,"RILEY, Sandra",13,0,0,14,16,0,0,0,0,0,0,0,0,0,12,0,0,0]
[2,0,"BREALEY, Jane",0,0,0,25,0,0,25,23,23,0,0,0,0,0,0,25,0,0]
[2,0,"CRISP, Zoe",16,0,17,0,0,22,0,0,14,0,0,0,0,0,17,19,0,0]
[2,0,"ANDREWS, Katherine",10,9,12,0,20,13,20,0,0,23,12,19,0,23,11,21,0,0]
[2,0,"GARTLAND, Moira",0,19,0,0,0,0,22,0,18,0,0,0,0,0,0,0,0,0]
[2,0,"FARLAM, Faye",0,0,0,0,0,17,0,0,0,0,0,0,0,21,20,20,0,0]
[2,0,"COSGROVE, Susie",0,0,0,0,14,16,0,0,0,0,0,0,0,16,15,16,0,0]
[2,0,"COWDRAY, Kat",0,0,0,0,26,0,26,0,22,26,24,26,0,27,25,27,0,0]
[2,0,"TURNER, Yvette",0,0,0,0,15,18,0,0,0,0,0,0,0,0,10,11,0,0]
[2,0,"HUNTER, Maria",22,22,0,22,22,0,0,22,0,0,18,25,0,22,21,0,0,0]
{"$rows_left_out":28}
{"sheet":"SortBest","index":2,"n_rows":106,"n_cols":20,"rows_kept":106,"cut":false,"hidden":false,"merged":[]}
["BODEN, Joe",30,30,30,30,30,0,0,0,0,0,0,0,0,0,0,0,0,0,{"$f":"SUM(B1:L1)","v":150}]
["JONES, Christopher",30,29,28,28,27,26,0,0,0,0,0,0,0,0,0,0,0,0,{"$f":"SUM(B2:L2)","v":168}]
["CHADWICK, Oliver",30,30,30,30,30,30,29,29,28,0,0,0,0,0,0,0,0,0,266]
["NORTON, Steve",27,27,26,26,26,25,25,24,24,23,20,0,0,0,0,0,0,0,273]
["WALKER, Jay",29,22,0,0,0,0,0,0,0,0,0,0,0,0,0,0,0,0,51]
["POLAND, Jack",30,29,0,0,0,0,0,0,0,0,0,0,0,0,0,0,0,0,59]
["PEARSE, Rob",30,30,29,29,29,29,29,29,29,29,29,28,27,0,0,0,0,0,321]
["GILLBANKS, Matt",27,27,26,26,25,0,0,0,0,0,0,0,0,0,0,0,0,0,131]
["DABNER, Phil",28,0,0,0,0,0,0,0,0,0,0,0,0,0,0,0,0,0,28]
["BASSETT, John",28,27,26,25,23,21,0,0,0,0,0,0,0,0,0,0,0,0,150]
["GREEN, Mike",26,0,0,0,0,0,0,0,0,0,0,0,0,0,0,0,0,0,26]
["HARLEY-GRIFFITHS, Mike",26,24,24,23,21,20,18,0,0,0,0,0,0,0,0,0,0,0,156]
["BREALEY, Steve",28,28,28,27,0,0,0,0,0,0,0,0,0,0,0,0,0,0,111]
["MCALISTER, Dave",26,26,25,25,24,24,23,23,23,22,22,19,0,0,0,0,0,0,263]
["CUTHBERT, Phil",28,28,28,28,27,25,24,0,0,0,0,0,0,0,0,0,0,0,188]
["MCARDLE, Connor",29,27,0,0,0,0,0,0,0,0,0,0,0,0,0,0,0,0,56]
["BARBAT, Tony",28,28,27,27,27,27,26,26,26,25,25,25,24,0,0,0,0,0,292]
["BIRD, Phil",25,25,24,24,21,0,0,0,0,0,0,0,0,0,0,0,0,0,119]
["HALL, Kevin",27,24,23,0,0,0,0,0,0,0,0,0,0,0,0,0,0,0,74]
["HAMPSHIRE, William",27,27,26,26,0,0,0,0,0,0,0,0,0,0,0,0,0,0,106]
["PLESTED, Tim",17,13,11,0,0,0,0,0,0,0,0,0,0,0,0,0,0,0,41]
["SHARP, Ben",23,20,20,0,0,0,0,0,0,0,0,0,0,0,0,0,0,0,63]
["HAMPSON, Aiden",13,0,0,0,0,0,0,0,0,0,0,0,0,0,0,0,0,0,13]
["STOCKER, Ken",10,8,6,0,0,0,0,0,0,0,0,0,0,0,0,0,0,0,24]
["JONES, Mike T",28,0,0,0,0,0,0,0,0,0,0,0,0,0,0,0,0,0,28]
["SEAL, Brian",28,22,22,22,22,22,19,16,0,0,0,0,0,0,0,0,0,0,173]
["POUSTIE, Mark",30,28,24,23,0,0,0,0,0,0,0,0,0,0,0,0,0,0,105]
["DYSON, Mike",29,28,27,25,25,21,21,0,0,0,0,0,0,0,0,0,0,0,176]
["GREENWOOD, Ryan",30,30,0,0,0,0,0,0,0,0,0,0,0,0,0,0,0,0,60]
["WATSON, Luke",29,0,0,0,0,0,0,0,0,0,0,0,0,0,0,0,0,0,29]
["ROUGHLEY, Andrew",22,21,21,21,0,0,0,0,0,0,0,0,0,0,0,0,0,0,85]
["SUMMERFIELD, Leon",26,16,15,15,15,0,0,0,0,0,0,0,0,0,0,0,0,0,87]
["MITCHELL, Rob",26,0,0,0,0,0,0,0,0,0,0,0,0,0,0,0,0,0,26]
["JOHNSTONE, Paul",25,24,24,23,22,0,0,0,0,0,0,0,0,0,0,0,0,0,118]
["HAMPSHIRE, Luke",30,30,29,0,0,0,0,0,0,0,0,0,0,0,0,0,0,0,89]
["MCARDLE, Derek",29,23,17,14,7,0,0,0,0,0,0,0,0,0,0,0,0,0,90]
["THOMAS, Dave",7,0,0,0,0,0,0,0,0,0,0,0,0,0,0,0,0,0,7]
["ROBSON, Michael",30,29,29,29,28,28,28,26,0,0,0,0,0,0,0,0,0,0,227]
["CONNELL, Martin",14,14,0,0,0,0,0,0,0,0,0,0,0,0,0,0,0,0,28]
["CLARK, Ray",29,29,29,0,0,0,0,0,0,0,0,0,0,0,0,0,0,0,87]
["COLE, Steve",25,17,15,12,12,0,0,0,0,0,0,0,0,0,0,0,0,0,81]
["BARHAM, Pete",29,27,26,26,25,24,19,19,17,17,17,16,0,0,0,0,0,0,246]
["YEM, Alex",26,26,0,0,0,0,0,0,0,0,0,0,0,0,0,0,0,0,52]
["HOGG, John",18,0,0,0,0,0,0,0,0,0,0,0,0,0,0,0,0,0,18]
["SALES, Sean",24,22,0,0,0,0,0,0,0,0,0,0,0,0,0,0,0,0,46]
["YANG, Jack",27,18,0,0,0,0,0,0,0,0,0,0,0,0,0,0,0,0,45]
["COSGROVE, Steve",30,30,30,29,29,28,28,28,28,27,27,26,25,23,0,0,0,0,314]
["WILD, Joshua",16,0,0,0,0,0,0,0,0,0,0,0,0,0,0,0,0,0,16]
["FOSTER, Stewart",25,25,23,20,14,14,10,9,8,0,0,0,0,0,0,0,0,0,148]
["GIBBONS, Neil",16,14,13,11,10,0,0,0,0,0,0,0,0,0,0,0,0,0,64]
["GOUGH, Dermot",26,25,24,24,0,0,0,0,0,0,0,0,0,0,0,0,0,0,99]
["NOBLE, Kenneth",9,0,0,0,0,0,0,0,0,0,0,0,0,0,0,0,0,0,9]
["CLARKE, Steve",19,0,0,0,0,0,0,0,0,0,0,0,0,0,0,0,0,0,19]
["BACKINSELL, Jim",24,0,0,0,0,0,0,0,0,0,0,0,0,0,0,0,0,0,24]
["ALI, Abir",19,11,0,0,0,0,0,0,0,0,0,0,0,0,0,0,0,0,30]
["GOODENOUGH, Mike",15,15,12,10,0,0,0,0,0,0,0,0,0,0,0,0,0,0,52]
["PERRY, Robert",13,0,0,0,0,0,0,0,0,0,0,0,0,0,0,0,0,0,13]
["WADE, David",20,19,16,0,0,0,0,0,0,0,0,0,0,0,0,0,0,0,55]
["FAYLE, Joseph",28,27,27,25,24,23,0,0,0,0,0,0,0,0,0,0,0,0,154]
["RAE, Nick",12,9,6,0,0,0,0,0,0,0,0,0,0,0,0,0,0,0,27]
["GORMAN, Louis",30,29,27,0,0,0,0,0,0,0,0,0,0,0,0,0,0,0,86]
["BROMLEY, Andrew",30,30,30,30,30,0,0,0,0,0,0,0,0,0,0,0,0,0,150]
["WARREN, Dominic",20,19,18,18,18,0,0,0,0,0,0,0,0,0,0,0,0,0,93]
["WHITWORTH, Rab",27,27,26,25,23,23,21,20,20,18,0,0,0,0,0,0,0,0,230]
["HOLMES, Tony",21,21,13,13,12,12,11,8,0,0,0,0,0,0,0,0,0,0,111]
["GREENWOOD, Kirsty",25,24,24,24,23,23,23,22,21,21,20,18,0,0,0,0,0,0,{"$f":"SUM(B66:L66)","v":250}]
["POLAND, Louise",19,19,0,0,0,0,0,0,0,0,0,0,0,0,0,0,0,0,38]
["CUTHBERT, Isabella",27,27,26,26,24,23,0,0,0,0,0,0,0,0,0,0,0,0,153]
["RYAN, Jenny",25,24,23,22,0,0,0,0,0,0,0,0,0,0,0,0,0,0,94]
["RILEY, Sandra",16,14,13,12,0,0,0,0,0,0,0,0,0,0,0,0,0,0,55]
["BREALEY, Jane",25,25,25,23,23,0,0,0,0,0,0,0,0,0,0,0,0,0,121]
["CRISP, Zoe",22,19,17,17,16,14,0,0,0,0,0,0,0,0,0,0,0,0,105]
["ANDREWS, Katherine",23,23,21,20,20,19,13,12,12,11,10,9,0,0,0,0,0,0,184]
["GARTLAND, Moira",22,19,18,0,0,0,0,0,0,0,0,0,0,0,0,0,0,0,59]
["FARLAM, Faye",21,20,20,17,0,0,0,0,0,0,0,0,0,0,0,0,0,0,78]
["COSGROVE, Susie",16,16,16,15,14,0,0,0,0,0,0,0,0,0,0,0,0,0,77]
["COWDRAY, Kat",27,27,26,26,26,26,25,24,22,0,0,0,0,0,0,0,0,0,229]
["TURNER, Yvette",18,15,11,10,0,0,0,0,0,0,0,0,0,0,0,0,0,0,54]
["HUNTER, Maria",25,22,22,22,22,22,22,21,18,0,0,0,0,0,0,0,0,0,196]
["CUCKSEY, Lesley-Anne",22,21,20,20,19,18,17,17,16,13,0,0,0,0,0,0,0,0,183]
{"$rows_left_out":26}