{"text_format":"1","workbook":"xlsx","n_sheets":3,"sheets":["Results13of18","RaceResults","SortBest"],"not_rendered":{"charts":0,"images":0,"macros":1,"external_links":0,"defined_names":2,"comments":0,"pivot_tables":0},"unopened":[],"bounds":{"document_bytes":16777216,"sheet_cells":100000,"rows_first":2000,"rows_last":500,"rows_between":2000,"halvings":0,"cell_chars":16384,"cell_head_chars":4096},"cells_cut":0,"cells_raw":0,"read":"whole","date_system":"1900"}

{"sheet":"Results13of18","index":0,"n_rows":89,"n_cols":22,"rows_kept":89,"cut":false,"hidden":false,"merged":[[0,1,0,3],[54,1,54,3]]}
[null,"WALLASEY ATHLETIC CLUB GRAND PRIX 2024-2025",null,null,"MT Royden Park 03/09/24","MT WCP  10/09/24","National Weston Park 14/09/24","MT Wallasey 17/09/24","MT Arrowe Park 24/09/24","BL 1 Norton Priory 29/09/24","LD Race 1 Sherdley Park 26/10/24","BL 2 Tattenhall 03/11/24","L&D Race 2 Sefton Park 23/11/24","Merseyside CC Arrowe Park 14/12/24","Northern CC Tatton Park  25/01/25","BL 3 Connah's Quay 26/01/25","L&D Champs Clarke's Garden 02/02/25","National Parliament Hill 22/02/25","LD Race 2 Beacon Park 01/03/25","BL 5 Capenhurst 16/03/25","BL 6 Mold 06/04/25","Total"]
["MEN","Division 1",1,"PEARSE, Rob",29,29,0,29,29,29,30,28,28,28,0,30,30,0,0,26,29,{"$f":"VLOOKUP(D2,SortBest!A:T,20,FALSE)","v":348}]
[null,null,2,"POUSTIE, Mark",26,25,0,25,26,26,29,23,27,27,29,0,28,30,0,24,25,{"$f":"VLOOKUP(D3,SortBest!A:T,20,FALSE)","v":323}]
[null,null,3,"BARBAT, Tony",24,0,0,0,23,25,27,24,26,24,28,26,27,29,29,23,26,{"$f":"VLOOKUP(D4,SortBest!A:T,20,FALSE)","v":315}]
[null,null,4,"KENNEDY, Alan",30,0,0,28,27,28,0,27,29,29,30,29,0,0,0,27,27,{"$f":"VLOOKUP(D5,SortBest!A:T,20,FALSE)","v":311}]
[null,null,5,"EVES, Scott",28,28,0,27,28,27,0,26,0,26,0,27,29,0,0,25,28,{"$f":"VLOOKUP(D6,SortBest!A:T,20,FALSE)","v":299}]
[null,null,6,"WOODS, Sam",25,24,0,0,24,24,28,25,0,25,0,25,0,0,30,20,0,{"$f":"VLOOKUP(D7,SortBest!A:T,20,FALSE)","v":250}]
[null,null,7,"BARHAM, Pete",21,22,0,23,20,21,0,21,0,23,0,24,26,0,0,21,23,{"$f":"VLOOKUP(D8,SortBest!A:T,20,FALSE)","v":245}]
[null,null,8,"MCALISTER, Dave",0,0,0,22,0,19,26,19,25,21,0,22,25,0,0,18,22,{"$f":"VLOOKUP(D9,SortBest!A:T,20,FALSE)","v":219}]
[null,null,9,"WHITWORTH, Rab",23,23,0,24,21,22,0,22,0,0,0,0,0,0,0,22,24,{"$f":"VLOOKUP(D10,SortBest!A:T,20,FALSE)","v":181}]
[null,null,10,"CHADWICK, Oliver",0,0,0,0,30,30,0,30,0,30,0,0,0,0,0,30,0,{"$f":"VLOOKUP(D11,SortBest!A:T,20,FALSE)","v":150}]
[null,null,11,"POLAND, Jack",0,30,0,30,0,0,0,29,30,0,0,0,0,0,0,29,0,{"$f":"VLOOKUP(D12,SortBest!A:T,20,FALSE)","v":148}]
[null,null,12,"NORTON, Steve",22,21,0,0,19,20,0,20,0,0,0,23,0,0,0,19,0,{"$f":"VLOOKUP(D13,SortBest!A:T,20,FALSE)","v":144}]
[null,null,13,"DABNER, Phil",27,26,0,26,25,0,0,0,0,0,0,0,0,0,0,0,0,{"$f":"VLOOKUP(D14,SortBest!A:T,20,FALSE)","v":104}]
[null,null,14,"CUTHBERT, Phil",0,0,0,0,22,23,0,0,0,0,27,0,0,28,0,0,0,{"$f":"VLOOKUP(D15,SortBest!A:T,20,FALSE)","v":100}]
[null,null,15,"BIRD, Phil",20,0,0,21,18,0,0,0,0,22,0,0,0,0,0,0,0,{"$f":"VLOOKUP(D16,SortBest!A:T,20,FALSE)","v":81}]
[null,null,16,"JONES, Christopher",0,0,0,0,0,0,0,0,0,0,0,28,0,0,0,0,30,{"$f":"VLOOKUP(D17,SortBest!A:T,20,FALSE)","v":58}]
[null,null,17,"MCARDLE, Connor",0,0,0,0,0,0,0,0,0,0,0,0,0,0,0,28,0,{"$f":"VLOOKUP(D18,SortBest!A:T,20,FALSE)","v":28}]
[null,null,18,"WATSON, Luke",0,27,0,0,0,0,0,0,0,0,0,0,0,0,0,0,0,{"$f":"VLOOKUP(D19,SortBest!A:T,20,FALSE)","v":27}]
[null,"Division 2",1,"GILLIES, George",27,29,0,28,29,27,29,24,30,30,30,28,30,0,30,30,29,{"$f":"VLOOKUP(D20,SortBest!A:T,20,FALSE)","v":352}]
[null,null,2,"BOWERS, Chris",25,28,0,27,26,24,0,22,0,29,29,0,0,0,0,22,22,{"$f":"VLOOKUP(D21,SortBest!A:T,20,FALSE)","v":254}]
[null,null,3,"SEAL, Brian",21,27,0,26,24,25,0,21,0,0,0,27,0,0,29,24,20,{"$f":"VLOOKUP(D22,SortBest!A:T,20,FALSE)","v":244}]
[null,null,4,"FERRONI, Stephen",30,30,0,30,30,30,0,30,0,0,0,30,0,0,0,0,30,{"$f":"VLOOKUP(D23,SortBest!A:T,20,FALSE)","v":240}]
[null,null,5,"SALES, Sean",22,26,0,0,25,0,0,19,29,0,0,24,27,0,0,20,19,{"$f":"VLOOKUP(D24,SortBest!A:T,20,FALSE)","v":211}]
[null,null,6,"COLE, Steve",17,21,0,22,19,23,27,18,0,0,0,23,0,0,0,18,17,{"$f":"VLOOKUP(D25,SortBest!A:T,20,FALSE)","v":205}]
[null,null,7,"WARREN, Dominic",23,23,0,25,0,0,0,20,28,0,0,26,28,0,0,0,0,{"$f":"VLOOKUP(D26,SortBest!A:T,20,FALSE)","v":173}]
[null,null,8,"LESLIE, Steven",0,0,0,29,0,28,0,26,0,0,0,29,0,0,0,27,26,{"$f":"VLOOKUP(D27,SortBest!A:T,20,FALSE)","v":165}]
[null,null,9,"CUTHBERT, Patrick",20,25,0,23,27,22,0,0,0,0,0,0,0,0,0,23,24,{"$f":"VLOOKUP(D28,SortBest!A:T,20,FALSE)","v":164}]
[null,null,10,"JONES, Mike T",29,0,0,0,0,0,28,25,0,0,0,0,29,0,0,26,25,{"$f":"VLOOKUP(D29,SortBest!A:T,20,FALSE)","v":162}]
[null,null,11,"MCARDLE, Derek",15,20,0,20,23,21,0,0,0,0,0,20,0,0,0,17,13,{"$f":"VLOOKUP(D30,SortBest!A:T,20,FALSE)","v":149}]
[null,null,12,"PERRY, Robert",13,14,0,0,16,0,0,11,27,28,0,15,0,0,0,10,0,{"$f":"VLOOKUP(D31,SortBest!A:T,20,FALSE)","v":134}]
[null,null,13,"BACKINSELL, Jim",0,0,0,19,22,20,0,17,0,0,0,22,0,0,0,16,15,{"$f":"VLOOKUP(D32,SortBest!A:T,20,FALSE)","v":131}]
[null,null,14,"DOHERTY, Mark",10,15,30,15,17,15,0,0,0,0,0,16,0,0,0,0,0,{"$f":"VLOOKUP(D33,SortBest!A:T,20,FALSE)","v":118}]
[null,null,15,"GORMAN, Louis",0,0,0,0,0,29,0,29,0,0,0,0,0,0,0,28,28,{"$f":"VLOOKUP(D34,SortBest!A:T,20,FALSE)","v":114}]
[null,null,16,"HOLMES, Tony",0,16,0,16,18,16,0,0,0,0,0,19,0,0,0,12,11,{"$f":"VLOOKUP(D35,SortBest!A:T,20,FALSE)","v":108}]
[null,null,17,"CONNOLLY, Patrick",18,19,0,17,21,18,0,13,0,0,0,0,0,0,0,0,0,{"$f":"VLOOKUP(D36,SortBest!A:T,20,FALSE)","v":106}]
[null,null,18,"RAE, Nick",12,12,0,13,15,14,0,10,0,0,0,0,0,0,0,9,10,{"$f":"VLOOKUP(D37,SortBest!A:T,20,FALSE)","v":95}]
[null,null,19,"GIBBONS, Neil",14,17,0,0,20,19,0,15,0,0,0,0,0,0,0,0,0,{"$f":"VLOOKUP(D38,SortBest!A:T,20,FALSE)","v":85}]
[null,null,20,"GRIFFITHS, Paul",0,0,0,0,0,0,0,16,0,0,0,25,0,0,0,21,21,{"$f":"VLOOKUP(D39,SortBest!A:T,20,FALSE)","v":83}]
[null,null,21,"ROBSON, Michael",0,0,0,0,0,26,0,23,0,0,0,0,0,0,0,25,0,{"$f":"VLOOKUP(D40,SortBest!A:T,20,FALSE)","v":74}]
[null,null,22,"MCARDLE, Pete",0,0,0,0,0,17,0,14,0,0,0,18,0,0,0,11,12,{"$f":"VLOOKUP(D41,SortBest!A:T,20,FALSE)","v":72}]
[null,null,23,"ROUGHLEY, Andrew",24,24,0,24,0,0,0,0,0,0,0,0,0,0,0,0,0,{"$f":"VLOOKUP(D42,SortBest!A:T,20,FALSE)","v":72}]
[null,null,24,"WADE, David",16,18,0,21,0,0,0,0,0,0,0,0,0,0,0,14,0,{"$f":"VLOOKUP(D43,SortBest!A:T,20,FALSE)","v":69}]
[null,null,25,"HOARE, Daniel",0,0,0,0,0,0,0,0,0,0,0,21,0,0,0,19,18,{"$f":"VLOOKUP(D44,SortBest!A:T,20,FALSE)","v":58}]
[null,null,26,"WYNNE, Mark",0,0,0,0,0,0,0,28,0,0,0,0,0,0,0,29,0,{"$f":"VLOOKUP(D45,SortBest!A:T,20,FALSE)","v":57}]
[null,null,27,"ANDERSON, Daniel",0,0,0,0,0,0,30,0,0,0,0,0,0,0,0,0,27,{"$f":"VLOOKUP(D46,SortBest!A:T,20,FALSE)","v":57}]
[null,null,28,"ELLISON, John",28,0,0,0,0,0,0,27,0,0,0,0,0,0,0,0,0,{"$f":"VLOOKUP(D47,SortBest!A:T,20,FALSE)","v":55}]
[null,null,29,"HAMPSHIRE, William",26,0,0,0,28,0,0,0,0,0,0,0,0,0,0,0,0,{"$f":"VLOOKUP(D48,SortBest!A:T,20,FALSE)","v":54}]
[null,null,30,"STOCKER, Ken",11,13,0,14,0,0,0,9,0,0,0,0,0,0,0,0,0,{"$f":"VLOOKUP(D49,SortBest!A:T,20,FALSE)","v":47}]
[null,null,31,"SUMMERFIELD, Leon",0,0,0,18,0,0,0,0,0,0,0,0,0,0,0,15,14,{"$f":"VLOOKUP(D50,SortBest!A:T,20,FALSE)","v":47}]
[null,null,32,"HUGHES, Gareth",0,0,0,0,0,0,0,12,0,0,0,17,0,0,0,13,0,{"$f":"VLOOKUP(D51,SortBest!A:T,20,FALSE)","v":42}]
[null,null,33,"SAUNDERS, Paul",19,22,0,0,0,0,0,0,0,0,0,0,0,0,0,0,0,{"$f":"VLOOKUP(D52,SortBest!A:T,20,FALSE)","v":41}]
[null,null,34,"JOHNSTONE, Paul",0,0,0,0,0,0,0,0,0,0,0,0,0,0,0,0,23,{"$f":"VLOOKUP(D53,SortBest!A:T,20,FALSE)","v":23}]
[null,null,35,"FEELY, Michael",0,0,0,0,0,0,0,0,0,0,0,0,0,0,0,0,16,{"$f":"VLOOKUP(D54,SortBest!A:T,20,FALSE)","v":16}]
[null,"WALLASEY ATHLETIC CLUB GRAND PRIX 2024-2025",null,null,"MT Royden Park 03/09/24","MT WCP  10/09/24","National Weston Park 14/09/24","MT Wallasey 17/09/24","MT Arrowe Park 24/09/24","BL 1 Norton Priory 29/09/24","LD Race 1 Sherdley Park 26/10/24","BL 2 Tattenhall 03/11/24","L&D Race 2 Sefton Park 23/11/24","Merseyside CC Arrowe Park 14/12/24","Northern CC Tatton Park  25/01/25","BL 3 Connah's Quay 26/01/25","L&D Champs Clarke's Garden 02/02/25","National Parliament Hill 22/02/25","LD Race 2 Beacon Park 01/03/25","BL 5 Capenhurst 16/03/25","BL 6 Mold 06/04/25","Total"]
["WOMEN",null,1,"BLACKLOCK, Becky",30,30,30,30,30,29,0,29,30,0,0,28,0,0,0,29,28,{"$f":"VLOOKUP(D56,SortBest!A:T,20,FALSE)","v":323}]
[null,null,2,"KENNY, Anna",28,29,0,28,29,28,0,28,29,29,0,29,30,0,0,27,0,{"$f":"VLOOKUP(D57,SortBest!A:T,20,FALSE)","v":314}]
[null,null,3,"REYNOLDS, Sue",23,22,26,22,22,24,27,22,0,0,27,25,25,0,28,24,25,{"$f":"VLOOKUP(D58,SortBest!A:T,20,FALSE)","v":298}]
[null,null,4,"MCARD, Jan",25,26,29,0,0,0,28,25,24,0,26,24,24,30,26,0,0,{"$f":"VLOOKUP(D59,SortBest!A:T,20,FALSE)","v":287}]
[null,null,5,"OPARA, Elaine",29,28,0,29,28,27,0,27,28,0,0,0,28,0,30,26,0,{"$f":"VLOOKUP(D60,SortBest!A:T,20,FALSE)","v":280}]
[null,null,6,"COWDRAY, Kat",0,0,28,0,0,26,29,26,26,27,28,26,27,0,29,0,0,{"$f":"VLOOKUP(D61,SortBest!A:T,20,FALSE)","v":272}]
[null,null,7,"CRISP, Zoe",19,20,24,20,21,19,0,0,20,0,24,20,23,0,27,22,0,{"$f":"VLOOKUP(D62,SortBest!A:T,20,FALSE)","v":259}]
[null,null,8,"ALTY, Michele",26,25,27,26,25,25,30,24,25,26,0,0,0,0,0,0,0,{"$f":"VLOOKUP(D63,SortBest!A:T,20,FALSE)","v":259}]
[null,null,9,"LAMONT, Sharon",16,16,22,17,18,16,23,17,18,22,23,18,19,29,24,16,21,{"$f":"VLOOKUP(D64,SortBest!A:T,20,FALSE)","v":254}]
[null,null,10,"CUCKSEY, Lesley-Anne",17,17,23,19,19,18,25,19,21,25,0,19,21,0,0,17,22,{"$f":"VLOOKUP(D65,SortBest!A:T,20,FALSE)","v":248}]
[null,null,11,"MCCONNELL, Vicky",0,0,0,27,27,0,0,23,0,30,30,27,29,0,0,28,27,{"$f":"VLOOKUP(D66,SortBest!A:T,20,FALSE)","v":248}]
[null,null,12,"ANDREWS, Katherine",22,23,25,23,0,0,26,0,23,0,25,21,0,0,0,21,20,{"$f":"VLOOKUP(D67,SortBest!A:T,20,FALSE)","v":229}]
[null,null,13,"CUTHBERT, Caet",15,15,0,14,17,0,0,16,17,21,22,14,17,28,0,0,0,{"$f":"VLOOKUP(D68,SortBest!A:T,20,FALSE)","v":196}]
[null,null,14,"HUNTER, Maria",20,19,0,21,0,21,0,21,0,0,0,22,22,0,0,23,24,{"$f":"VLOOKUP(D69,SortBest!A:T,20,FALSE)","v":193}]
[null,null,15,"STANSFIELD, Helen-Anne",0,0,0,0,0,23,0,0,27,28,29,23,26,0,0,19,0,{"$f":"VLOOKUP(D70,SortBest!A:T,20,FALSE)","v":175}]
[null,null,16,"BARBAT, Julie",0,0,0,0,0,0,24,20,22,24,0,0,0,0,25,20,23,{"$f":"VLOOKUP(D71,SortBest!A:T,20,FALSE)","v":158}]
[null,null,17,"REES, Mary",14,18,0,10,20,17,0,18,0,23,0,17,0,0,0,18,0,{"$f":"VLOOKUP(D72,SortBest!A:T,20,FALSE)","v":155}]
[null,null,18,"KREMLING, Paulena",0,0,0,0,0,30,0,30,0,0,0,30,0,0,0,0,30,{"$f":"VLOOKUP(D73,SortBest!A:T,20,FALSE)","v":120}]
[null,null,19,"STANLEY, Alexandra",21,21,0,25,24,22,0,0,0,0,0,0,0,0,0,0,0,{"$f":"VLOOKUP(D74,SortBest!A:T,20,FALSE)","v":113}]
[null,null,20,"THOMPSON, Joniece",24,24,0,24,23,0,0,0,0,0,0,0,0,0,0,0,0,{"$f":"VLOOKUP(D75,SortBest!A:T,20,FALSE)","v":95}]
[null,null,21,"DAVIES, Nicci",13,13,0,13,16,0,0,0,19,0,0,0,18,0,0,0,0,{"$f":"VLOOKUP(D76,SortBest!A:T,20,FALSE)","v":92}]
[null,null,22,"EDWARDS, Jane",9,12,21,15,15,15,0,0,0,0,0,0,0,0,0,0,0,{"$f":"VLOOKUP(D77,SortBest!A:T,20,FALSE)","v":87}]
[null,null,23,"DABNER, Erin",27,27,0,0,26,0,0,0,0,0,0,0,0,0,0,0,0,{"$f":"VLOOKUP(D78,SortBest!A:T,20,FALSE)","v":80}]
[null,null,24,"RILEY, Sandra",12,14,0,18,0,0,0,0,0,0,0,16,0,0,0,0,0,{"$f":"VLOOKUP(D79,SortBest!A:T,20,FALSE)","v":60}]
[null,null,25,"NICHOLSON, Chloe",0,0,0,0,0,0,0,0,0,0,0,0,0,0,0,30,29,{"$f":"VLOOKUP(D80,SortBest!A:T,20,FALSE)","v":59}]
[null,null,26,"BROWN, Allison",0,0,0,0,0,0,0,0,0,0,0,0,0,0,0,25,26,{"$f":"VLOOKUP(D81,SortBest!A:T,20,FALSE)","v":51}]
[null,null,27,"WYNTER, Serena",10,10,0,0,0,0,0,0,0,0,0,0,20,0,0,0,0,{"$f":"VLOOKUP(D82,SortBest!A:T,20,FALSE)","v":40}]
[null,null,28,"MAGEE, Mary",11,11,0,16,0,0,0,0,0,0,0,0,0,0,0,0,0,{"$f":"VLOOKUP(D83,SortBest!A:T,20,FALSE)","v":38}]
[null,null,29,"ELLISON, Sandra",8,0,0,12,0,0,0,0,0,0,0,0,0,0,0,0,0,{"$f":"VLOOKUP(D84,SortBest!A:T,20,FALSE)","v":20}]
[null,null,30,"CLARKE, Isabella",0,0,0,0,0,20,0,0,0,0,0,0,0,0,0,0,0,{"$f":"VLOOKUP(D85,SortBest!A:T,20,FALSE)","v":20}]
[null,null,31,"CUTHBERT, Isabella",18,0,0,0,0,0,0,0,0,0,0,0,0,0,0,0,0,{"$f":"VLOOKUP(D86,SortBest!A:T,20,FALSE)","v":18}]
[null,null,32,"BACKINSELL, Kitty",0,0,0,0,0,0,0,0,0,0,0,15,0,0,0,0,0,{"$f":"VLOOKUP(D87,SortBest!A:T,20,FALSE)","v":15}]
[null,null,33,"CHAPMAN, Nicci",0,0,0,11,0,0,0,0,0,0,0,0,0,0,0,0,0,{"$f":"VLOOKUP(D88,SortBest!A:T,20,FALSE)","v":11}]
[null,null,null,null,null,null,null,null,null,"Best 12 from 17",null,"Ever Present"]

{"sheet":"RaceResults","index":1,"n_rows":87,"n_cols":21,"rows_kept":87,"cut":false,"hidden":false,"merged":[]}
["AgeCat","RunnerGPDivision","Name","Race1Score","Race2Score","Race3Score","Race4Score","Race5Score","Race6Score","Race7Score","Race8Score","Race9Score","Race10Score","Race11Score","Race12Score","Race13Score","Race14Score","Race15Score","Race16Score","Race17Score","Race18Score"]
[1,1,"POLAND, Jack",0,30,0,30,0,0,0,29,30,0,0,0,0,0,0,29,0,0]
[1,1,"WHITWORTH, Rab",23,23,0,24,21,22,0,22,0,0,0,0,0,0,0,22,24,0]
[1,1,"WATSON, Luke",0,27,0,0,0,0,0,0,0,0,0,0,0,0,0,0,0,0]
[1,1,"CHADWICK, Oliver",0,0,0,0,30,30,0,30,0,30,0,0,0,0,0,30,0,0]
[1,1,"BIRD, Phil",20,0,0,21,18,0,0,0,0,22,0,0,0,0,0,0,0,0]
[1,1,"JONES, Christopher",0,0,0,0,0,0,0,0,0,0,0,28,0,0,0,0,30,0]
[1,1,"WOODS, Sam",25,24,0,0,24,24,28,25,0,25,0,25,0,0,30,20,0,0]
[1,1,"KENNEDY, Alan",30,0,0,28,27,28,0,27,29,29,30,29,0,0,0,27,27,0]
[1,1,"BARHAM, Pete",21,22,0,23,20,21,0,21,0,23,0,24,26,0,0,21,23,0]
[1,1,"POUSTIE, Mark",26,25,0,25,26,26,29,23,27,27,29,0,28,30,0,24,25,0]
[1,1,"PEARSE, Rob",29,29,0,29,29,29,30,28,28,28,0,30,30,0,0,26,29,0]
[1,1,"DABNER, Phil",27,26,0,26,25,0,0,0,0,0,0,0,0,0,0,0,0,0]
[1,1,"MCALISTER, Dave",0,0,0,22,0,19,26,19,25,21,0,22,25,0,0,18,22,0]
[1,1,"CUTHBERT, Phil",0,0,0,0,22,23,0,0,0,0,27,0,0,28,0,0,0,0]
[1,1,"MCARDLE, Connor",0,0,0,0,0,0,0,0,0,0,0,0,0,0,0,28,0,0]
[1,1,"BARBAT, Tony",24,0,0,0,23,25,27,24,26,24,28,26,27,29,29,23,26,0]
[1,1,"NORTON, Steve",22,21,0,0,19,20,0,20,0,0,0,23,0,0,0,19,0,0]
[1,1,"EVES, Scott",28,28,0,27,28,27,0,26,0,26,0,27,29,0,0,25,28,0]
[1,0,"JONES, Mike T",29,0,0,0,0,0,28,25,0,0,0,0,29,0,0,26,25,0]
[1,0,"STOCKER, Ken",11,13,0,14,0,0,0,9,0,0,0,0,0,0,0,0,0,0]
[1,0,"SALES, Sean",22,26,0,0,25,0,0,19,29,0,0,24,27,0,0,20,19,0]
[1,0,"SEAL, Brian",21,27,0,26,24,25,0,21,0,0,0,27,0,0,29,24,20,0]
[1,0,"GIBBONS, Neil",14,17,0,0,20,19,0,15,0,0,0,0,0,0,0,0,0,0]
[1,0,"CUTHBERT, Patrick",20,25,0,23,27,22,0,0,0,0,0,0,0,0,0,23,24,0]
[1,0,"CONNOLLY, Patrick",18,19,0,17,21,18,0,13,0,0,0,0,0,0,0,0,0,0]
[1,0,"DOHERTY, Mark",10,15,30,15,17,15,0,0,0,0,0,16,0,0,0,0,0,0]
[1,0,"COLE, Steve",17,21,0,22,19,23,27,18,0,0,0,23,0,0,0,18,17,0]
[1,0,"FEELY, Michael",0,0,0,0,0,0,0,0,0,0,0,0,0,0,0,0,16,0]
[1,0,"FERRONI, Stephen",30,30,0,30,30,30,0,30,0,0,0,30,0,0,0,0,30,0]
[1,0,"HAMPSHIRE, William",26,0,0,0,28,0,0,0,0,0,0,0,0,0,0,0,0,0]
[1,0,"GILLIES, George",27,29,0,28,29,27,29,24,30,30,30,28,30,0,30,30,29,0]
[1,0,"BOWERS, Chris",25,28,0,27,26,24,0,22,0,29,29,0,0,0,0,22,22,0]
[1,0,"ROBSON, Michael",0,0,0,0,0,26,0,23,0,0,0,0,0,0,0,25,0,0]
[1,0,"MCARDLE, Derek",15,20,0,20,23,21,0,0,0,0,0,20,0,0,0,17,13,0]
[1,0,"ELLISON, John",28,0,0,0,0,0,0,27,0,0,0,0,0,0,0,0,0,0]
[1,0,"WYNNE, Mark",0,0,0,0,0,0,0,28,0,0,0,0,0,0,0,29,0,0]
[1,0,"GRIFFITHS, Paul",0,0,0,0,0,0,0,16,0,0,0,25,0,0,0,21,21,0]
[1,0,"MCARDLE, Pete",0,0,0,0,0,17,0,14,0,0,0,18,0,0,0,11,12,0]
[1,0,"HOARE, Daniel",0,0,0,0,0,0,0,0,0,0,0,21,0,0,0,19,18,0]
[1,0,"LESLIE, Steven",0,0,0,29,0,28,0,26,0,0,0,29,0,0,0,27,26,0]
[1,0,"HOLMES, Tony",0,16,0,16,18,16,0,0,0,0,0,19,0,0,0,12,11,0]
[1,0,"BACKINSELL, Jim",0,0,0,19,22,20,0,17,0,0,0,22,0,0,0,16,15,0]
[1,0,"HUGHES, Gareth",0,0,0,0,0,0,0,12,0,0,0,17,0,0,0,13,0,0]
[1,0,"PERRY, Robert",13,14,0,0,16,0,0,11,27,28,0,15,0,0,0,10,0,0]
[1,0,"WADE, David",16,18,0,21,0,0,0,0,0,0,0,0,0,0,0,14,0,0]
[1,0,"RAE, Nick",12,12,0,13,15,14,0,10,0,0,0,0,0,0,0,9,10,0]
[1,0,"GORMAN, Louis",0,0,0,0,0,29,0,29,0,0,0,0,0,0,0,28,28,0]
[1,0,"WARREN, Dominic",23,23,0,25,0,0,0,20,28,0,0,26,28,0,0,0,0,0]
[1,0,"SUMMERFIELD, Leon",0,0,0,18,0,0,0,0,0,0,0,0,0,0,0,15,14,0]
[1,0,"ROUGHLEY, Andrew",24,24,0,24,0,0,0,0,0,0,0,0,0,0,0,0,0,0]
[1,0,"SAUNDERS, Paul",19,22,0,0,0,0,0,0,0,0,0,0,0,0,0,0,0,0]
[1,0,"JOHNSTONE, Paul",0,0,0,0,0,0,0,0,0,0,0,0,0,0,0,0,23,0]
[1,0,"ANDERSON, Daniel",0,0,0,0,0,0,30,0,0,0,0,0,0,0,0,0,27,0]
[2,0,"DAVIES, Nicci",13,13,0,13,16,0,0,0,19,0,0,0,18,0,0,0,0,0]
[2,0,"CUCKSEY, Lesley-Anne",17,17,23,19,19,18,25,19,21,25,0,19,21,0,0,17,22,0]
[2,0,"OPARA, Elaine",29,28,0,29,28,27,0,27,28,0,0,0,28,0,30,26,0,0]
[2,0,"CUTHBERT, Caet",15,15,0,14,17,0,0,16,17,21,22,14,17,28,0,0,0,0]
[2,0,"MCCONNELL, Vicky",0,0,0,27,27,0,0,23,0,30,30,27,29,0,0,28,27,0]
[2,0,"HUNTER, Maria",20,19,0,21,0,21,0,21,0,0,0,22,22,0,0,23,24,0]
[2,0,"BACKINSELL, Kitty",0,0,0,0,0,0,0,0,0,0,0,15,0,0,0,0,0,0]
[2,0,"BARBAT, Julie",0,0,0,0,0,0,24,20,22,24,0,0,0,0,25,20,23,0]
[2,0,"ELLISON, Sandra",8,0,0,12,0,0,0,0,0,0,0,0,0,0,0,0,0,0]
[2,0,"BROWN, Allison",0,0,0,0,0,0,0,0,0,0,0,0,0,0,0,25,26,0]
[2,0,"WYNTER, Serena",10,10,0,0,0,0,0,0,0,0,0,0,20,0,0,0,0,0]
[2,0,"STANLEY, Alexandra",21,21,0,25,24,22,0,0,0,0,0,0,0,0,0,0,0,0]
[2,0,"CUTHBERT, Isabella",18,0,0,0,0,0,0,0,0,0,0,0,0,0,0,0,0,0]
[2,0,"EDWARDS, Jane",9,12,21,15,15,15,0,0,0,0,0,0,0,0,0,0,0,0]
[2,0,"CLARKE, Isabella",0,0,0,0,0,20,0,0,0,0,0,0,0,0,0,0,0,0]
[2,0,"LAMONT, Sharon",16,16,22,17,18,16,23,17,18,22,23,18,19,29,24,16,21,0]
[2,0,"CRISP, Zoe",19,20,24,20,21,19,0,0,20,0,24,20,23,0,27,22,0,0]
[2,0,"COWDRAY, Kat",0,0,28,0,0,26,29,26,26,27,28,26,27,0,29,0,0,0]
[2,0,"DABNER, Erin",27,27,0,0,26,0,0,0,0,0,0,0,0,0,0,0,0,0]
[2,0,"ANDREWS, Katherine",22,23,25,23,0,0,26,0,23,0,25,21,0,0,0,21,20,0]
[2,0,"THOMPSON, Joniece",24,24,0,24,23,0,0,0,0,0,0,0,0,0,0,0,0,0]
[2,0,"MAGEE, Mary",11,11,0,16,0,0,0,0,0,0,0,0,0,0,0,0,0,0]
[2,0,"BLACKLOCK, Becky",30,30,30,30,30,29,0,29,30,0,0,28,0,0,0,29,28,0]
[2,0,"ALTY, Michele",26,25,27,26,25,25,30,24,25,26,0,0,0,0,0,0,0,0]
[2,0,"CHAPMAN, Nicci",0,0,0,11,0,0,0,0,0,0,0,0,0,0,0,0,0,0]
[2,0,"REES, Mary",14,18,0,10,20,17,0,18,0,23,0,17,0,0,0,18,0,0]
[2,0,"RILEY, Sandra",12,14,0,18,0,0,0,0,0,0,0,16,0,0,0,0,0,0]
[2,0,"KENNY, Anna",28,29,0,28,29,28,0,28,29,29,0,29,30,0,0,27,0,0]
[2,0,"NICHOLSON, Chloe",0,0,0,0,0,0,0,0,0,0,0,0,0,0,0,30,29,0]
[2,0,"KREMLING, Paulena",0,0,0,0,0,30,0,30,0,0,0,30,0,0,0,0,30,0]
[2,0,"MCARD, Jan",25,26,29,0,0,0,28,25,24,0,26,24,24,30,26,0,0,0]
[2,0,"STANSFIELD, Helen-Anne",0,0,0,0,0,23,0,0,27,28,29,23,26,0,0,19,0,0]
[2,0,"REYNOLDS, Sue",23,22,26,22,22,24,27,22,0,0,27,25,25,0,28,24,25,0]

{"sheet":"SortBest","index":2,"n_rows":86,"n_cols":20,"rows_kept":86,"cut":false,"hidden":false,"merged":[]}
["POLAND, Jack",30,30,30,29,29,0,0,0,0,0,0,0,0,0,0,0,0,0,{"$f":"SUM(B1:M1)","v":148}]
["WHITWORTH, Rab",24,24,23,23,22,22,22,21,0,0,0,0,0,0,0,0,0,0,{"$f":"SUM(B2:M2)","v":181}]
["WATSON, Luke",27,0,0,0,0,0,0,0,0,0,0,0,0,0,0,0,0,0,27]
["CHADWICK, Oliver",30,30,30,30,30,0,0,0,0,0,0,0,0,0,0,0,0,0,150]
["BIRD, Phil",22,21,20,18,0,0,0,0,0,0,0,0,0,0,0,0,0,0,81]
["JONES, Christopher",30,28,0,0,0,0,0,0,0,0,0,0,0,0,0,0,0,0,58]
["WOODS, Sam",30,28,25,25,25,25,24,24,24,20,0,0,0,0,0,0,0,0,250]
["KENNEDY, Alan",30,30,29,29,29,28,28,27,27,27,27,0,0,0,0,0,0,0,311]
["BARHAM, Pete",26,24,23,23,23,22,21,21,21,21,20,0,0,0,0,0,0,0,245]
["POUSTIE, Mark",30,29,29,28,27,27,26,26,26,25,25,25,24,23,0,0,0,0,323]
["PEARSE, Rob",30,30,30,29,29,29,29,29,29,28,28,28,26,0,0,0,0,0,348]
["DABNER, Phil",27,26,26,25,0,0,0,0,0,0,0,0,0,0,0,0,0,0,104]
["MCALISTER, Dave",26,25,25,22,22,22,21,19,19,18,0,0,0,0,0,0,0,0,219]
["CUTHBERT, Phil",28,27,23,22,0,0,0,0,0,0,0,0,0,0,0,0,0,0,100]
["MCARDLE, Connor",28,0,0,0,0,0,0,0,0,0,0,0,0,0,0,0,0,0,28]
["BARBAT, Tony",29,29,28,27,27,26,26,26,25,24,24,24,23,23,0,0,0,0,315]
["NORTON, Steve",23,22,21,20,20,19,19,0,0,0,0,0,0,0,0,0,0,0,144]
["EVES, Scott",29,28,28,28,28,27,27,27,26,26,25,0,0,0,0,0,0,0,299]
["JONES, Mike T",29,29,28,26,25,25,0,0,0,0,0,0,0,0,0,0,0,0,162]
["STOCKER, Ken",14,13,11,9,0,0,0,0,0,0,0,0,0,0,0,0,0,0,47]
["SALES, Sean",29,27,26,25,24,22,20,19,19,0,0,0,0,0,0,0,0,0,211]
["SEAL, Brian",29,27,27,26,25,24,24,21,21,20,0,0,0,0,0,0,0,0,244]
["GIBBONS, Neil",20,19,17,15,14,0,0,0,0,0,0,0,0,0,0,0,0,0,85]
["CUTHBERT, Patrick",27,25,24,23,23,22,20,0,0,0,0,0,0,0,0,0,0,0,164]
["CONNOLLY, Patrick",21,19,18,18,17,13,0,0,0,0,0,0,0,0,0,0,0,0,106]
["DOHERTY, Mark",30,17,16,15,15,15,10,0,0,0,0,0,0,0,0,0,0,0,118]
["COLE, Steve",27,23,23,22,21,19,18,18,17,17,0,0,0,0,0,0,0,0,205]
["FEELY, Michael",16,0,0,0,0,0,0,0,0,0,0,0,0,0,0,0,0,0,16]
["FERRONI, Stephen",30,30,30,30,30,30,30,30,0,0,0,0,0,0,0,0,0,0,240]
["HAMPSHIRE, William",28,26,0,0,0,0,0,0,0,0,0,0,0,0,0,0,0,0,54]
["GILLIES, George",30,30,30,30,30,30,29,29,29,29,28,28,27,27,24,0,0,0,352]
["BOWERS, Chris",29,29,28,27,26,25,24,22,22,22,0,0,0,0,0,0,0,0,254]
["ROBSON, Michael",26,25,23,0,0,0,0,0,0,0,0,0,0,0,0,0,0,0,74]
["MCARDLE, Derek",23,21,20,20,20,17,15,13,0,0,0,0,0,0,0,0,0,0,149]
["ELLISON, John",28,27,0,0,0,0,0,0,0,0,0,0,0,0,0,0,0,0,55]
["WYNNE, Mark",29,28,0,0,0,0,0,0,0,0,0,0,0,0,0,0,0,0,57]
["GRIFFITHS, Paul",25,21,21,16,0,0,0,0,0,0,0,0,0,0,0,0,0,0,83]
["MCARDLE, Pete",18,17,14,12,11,0,0,0,0,0,0,0,0,0,0,0,0,0,72]
["HOARE, Daniel",21,19,18,0,0,0,0,0,0,0,0,0,0,0,0,0,0,0,58]
["LESLIE, Steven",29,29,28,27,26,26,0,0,0,0,0,0,0,0,0,0,0,0,165]
["HOLMES, Tony",19,18,16,16,16,12,11,0,0,0,0,0,0,0,0,0,0,0,108]
["BACKINSELL, Jim",22,22,20,19,17,16,15,0,0,0,0,0,0,0,0,0,0,0,131]
["HUGHES, Gareth",17,13,12,0,0,0,0,0,0,0,0,0,0,0,0,0,0,0,42]
["PERRY, Robert",28,27,16,15,14,13,11,10,0,0,0,0,0,0,0,0,0,0,134]
["WADE, David",21,18,16,14,0,0,0,0,0,0,0,0,0,0,0,0,0,0,69]
["RAE, Nick",15,14,13,12,12,10,10,9,0,0,0,0,0,0,0,0,0,0,95]
["GORMAN, Louis",29,29,28,28,0,0,0,0,0,0,0,0,0,0,0,0,0,0,114]
["WARREN, Dominic",28,28,26,25,23,23,20,0,0,0,0,0,0,0,0,0,0,0,173]
["SUMMERFIELD, Leon",18,15,14,0,0,0,0,0,0,0,0,0,0,0,0,0,0,0,47]
["ROUGHLEY, Andrew",24,24,24,0,0,0,0,0,0,0,0,0,0,0,0,0,0,0,72]
["SAUNDERS, Paul",22,19,0,0,0,0,0,0,0,0,0,0,0,0,0,0,0,0,41]
["JOHNSTONE, Paul",23,0,0,0,0,0,0,0,0,0,0,0,0,0,0,0,0,0,23]
["ANDERSON, Daniel",30,27,0,0,0,0,0,0,0,0,0,0,0,0,0,0,0,0,57]
["DAVIES, Nicci",19,18,16,13,13,13,0,0,0,0,0,0,0,0,0,0,0,0,92]
["CUCKSEY, Lesley-Anne",25,25,23,22,21,21,19,19,19,19,18,17,17,17,0,0,0,0,248]
["OPARA, Elaine",30,29,29,28,28,28,28,27,27,26,0,0,0,0,0,0,0,0,280]
["CUTHBERT, Caet",28,22,21,17,17,17,16,15,15,14,14,0,0,0,0,0,0,0,196]
["MCCONNELL, Vicky",30,30,29,28,27,27,27,27,23,0,0,0,0,0,0,0,0,0,248]
["HUNTER, Maria",24,23,22,22,21,21,21,20,19,0,0,0,0,0,0,0,0,0,193]
["BACKINSELL, Kitty",15,0,0,0,0,0,0,0,0,0,0,0,0,0,0,0,0,0,15]
["BARBAT, Julie",25,24,24,23,22,20,20,0,0,0,0,0,0,0,0,0,0,0,158]
["ELLISON, Sandra",12,8,0,0,0,0,0,0,0,0,0,0,0,0,0,0,0,0,20]
["BROWN, Allison",26,25,0,0,0,0,0,0,0,0,0,0,0,0,0,0,0,0,51]
["WYNTER, Serena",20,10,10,0,0,0,0,0,0,0,0,0,0,0,0,0,0,0,40]
["STANLEY, Alexandra",25,24,22,21,21,0,0,0,0,0,0,0,0,0,0,0,0,0,113]
["CUTHBERT, Isabella",18,0,0,0,0,0,0,0,0,0,0,0,0,0,0,0,0,0,{"$f":"SUM(B66:M66)","v":18}]
["EDWARDS, Jane",21,15,15,15,12,9,0,0,0,0,0,0,0,0,0,0,0,0,87]
["CLARKE, Isabella",20,0,0,0,0,0,0,0,0,0,0,0,0,0,0,0,0,0,20]
["LAMONT, Sharon",29,24,23,23,22,22,21,19,18,18,18,17,17,16,16,16,16,0,254]
["CRISP, Zoe",27,24,24,23,22,21,20,20,20,20,19,19,0,0,0,0,0,0,259]
["COWDRAY, Kat",29,29,28,28,27,27,26,26,26,26,0,0,0,0,0,0,0,0,272]
["DABNER, Erin",27,27,26,0,0,0,0,0,0,0,0,0,0,0,0,0,0,0,80]
["ANDREWS, Katherine",26,25,25,23,23,23,22,21,21,20,0,0,0,0,0,0,0,0,229]
["THOMPSON, Joniece",24,24,24,23,0,0,0,0,0,0,0,0,0,0,0,0,0,0,95]
["MAGEE, Mary",16,11,11,0,0,0,0,0,0,0,0,0,0,0,0,0,0,0,38]
["BLACKLOCK, Becky",30,30,30,30,30,30,29,29,29,28,28,0,0,0,0,0,0,0,323]
["ALTY, Michele",30,27,26,26,26,25,25,25,25,24,0,0,0,0,0,0,0,0,259]
["CHAPMAN, Nicci",11,0,0,0,0,0,0,0,0,0,0,0,0,0,0,0,0,0,11]
["REES, Mary",23,20,18,18,18,17,17,14,10,0,0,0,0,0,0,0,0,0,155]
["RILEY, Sandra",18,16,14,12,0,0,0,0,0,0,0,0,0,0,0,0,0,0,60]
["KENNY, Anna",30,29,29,29,29,29,28,28,28,28,27,0,0,0,0,0,0,0,314]
["NICHOLSON, Chloe",30,29,0,0,0,0,0,0,0,0,0,0,0,0,0,0,0,0,59]
["KREMLING, Paulena",30,30,30,30,0,0,0,0,0,0,0,0,0,0,0,0,0,0,120]
["MCARD, Jan",30,29,28,26,26,26,25,25,24,24,24,0,0,0,0,0,0,0,287]
["STANSFIELD, Helen-Anne",29,28,27,26,23,23,19,0,0,0,0,0,0,0,0,0,0,0,175]
["REYNOLDS, Sue",28,27,27,26,25,25,25,24,24,23,22,22,22,22,0,0,0,0,298]